tripleo xena-3

Milestone information

Project:
tripleo
Series:
xena
Version:
xena-3
Expected:
2021-09-03  
Active:
Yes. Drivers can target bugs and blueprints to this milestone.  

Activities

Assigned to you:
No blueprints or bugs assigned to you.
Assignees:
1 Ade Lee, 9 Alex Schultz, 2 Amol Kahat, 1 Ananya Banerjee, 3 Brent Eagles, 2 Christian Schwede, 7 Cédric Jeanneret, 9 Damien Ciabrini, 1 Daniel Bengtsson, 1 David Peacock, 1 David Vallee Delisle, 2 Emilien Macchi, 1 Francesco Pantano, 1 Gael Chamoulaud, 1 Grzegorz Grasza, 2 Harald Jensås, 1 Haresh, 1 Jakub Libosvar, 1 James Slagle, 2 Jiri Podivin, 1 John Fulton, 4 Jose Luis Franco, 1 Kamil Sambor, 1 Kevin Carter, 1 Luke Short, 2 Martin Schuppert, 5 Michele Baldessari, 8 Rabi Mishra, 2 Rafael Folco, 1 Rajesh Tailor, 1 Rohit Londhe, 7 Ronelle Landy, 1 Sagi (Sergey) Shnaidman, 1 Sandeep Yadav, 1 Slawek Kaplonski, 9 Sofer Athlan-Guyot, 1 Soniya Murlidhar Vyas, 1 Sorin Sbarnea, 2 Takashi Kajinami, 2 Tom Barron, 1 Yadnesh Kulkarni, 2 chandan kumar, 1 mathieu bultel, 3 yatin
Blueprints:
No blueprints are targeted to this milestone.
Bugs:
3 New, 9 Incomplete, 7 Confirmed, 126 Triaged, 56 In Progress, 1 Fix Committed, 53 Fix Released

0 blueprints and 255 bugs targeted

Bug report Importance Assignee Status
1928936 #1928936 Tempest: neutron_tempest_plugin.scenario.test_trunk.TrunkTest.test_trunk_subport_lifecycle 3 High   0 New
1926583 #1926583 How to create tripleo-validations development environment 4 Medium Gael Chamoulaud  0 New
1905667 #1905667 Deployment of multiple overcloud stacks using single undercloud failed with "msg": "Cloud overcloud-two was not found." 5 Low   0 New
1921285 #1921285 tripleo-ci-centos-8-scenario000-multinode-oooq-container-updates is failing while pulling containers 2 Critical   1 Incomplete
1933962 #1933962 Containers not updating with rpms from Depends-On patches. 3 High Ronelle Landy  1 Incomplete
1934994 #1934994 Octavia HealthMonitorScenarioTest are failing with Load Balanceris immutable and cannot be updated. 3 High   1 Incomplete
1919111 #1919111 [master] tempest.lib.exceptions.TimeoutException: Request timed out failing on fs020 2 Critical   1 Incomplete
1927517 #1927517 [CI] tripleo-ci-centos-8-content-provider fails on stable/train 2 Critical   1 Incomplete
1930735 #1930735 Queens: ModuleNotFoundError: No module named 'yum' 2 Critical   1 Incomplete
1932970 #1932970 test test only a test 2 Critical   1 Incomplete
1938801 #1938801 test bug for wes 2 Critical   1 Incomplete
1916689 #1916689 Upgrade jobs looking for wrong hash 4 Medium   1 Incomplete
1913438 #1913438 After upgrade to mariadb 10.3, tables are not converted to new default row format 3 High Damien Ciabrini  6 Confirmed
1917913 #1917913 When upgrading from old version python-docker may be missing 3 High Sofer Athlan-Guyot  6 Confirmed
1918133 #1918133 Haproxy code use cibadmin while the cluster may be stopped. 3 High Sofer Athlan-Guyot  6 Confirmed
1881288 #1881288 TypeError: find_module() missing 1 required positional argument: 'path' 4 Medium   6 Confirmed
1906505 #1906505 HA: galera and ovn-dbs are needlessly restarted at each stack update 4 Medium Damien Ciabrini  6 Confirmed
1921351 #1921351 HA: moving VIP away during minor update can leave some VIP stopped 1 Undecided Damien Ciabrini  6 Confirmed
1934130 #1934130 oslo.cache's pymemcache backend doesn't recover from socket disconnection 1 Undecided Damien Ciabrini  6 Confirmed
1885311 #1885311 python-tempestconf: 409 Conflict Image status transition from active to saving is not allowed' 2 Critical   7 Triaged
1887427 #1887427 TripleO CI jobs do not fail on package build errors 2 Critical Ronelle Landy  7 Triaged
1887660 #1887660 DLRN promoter failed to create manifest for neutron-metadata-agent-ovn container in c7 train 2 Critical   7 Triaged
1896126 #1896126 initialize tempest workspace: A workspace already exists 2 Critical Rafael Folco  7 Triaged
1897949 #1897949 [update][queens] layered openvswitch workaround is broken. 2 Critical Sofer Athlan-Guyot  7 Triaged
1899209 #1899209 tox tests are failing after multiple retries ...No package matching 'gettext' is available " 2 Critical   7 Triaged
1900357 #1900357 fs020 queens is failing tempest tests - test_floatingip.FloatingIPQosTest and test_server_multi_create_auto_allocate 2 Critical Soniya Murlidhar Vyas  7 Triaged
1901917 #1901917 ci.centos jobs in master failing introspection with ERROR ironic_inspector.process TypeError: unhashable type: 'list' 2 Critical   7 Triaged
1901996 #1901996 tripleo-ci-centos-8-scenario010-standalone is failing on tempest test with error 'Load Balancer is immutable and cannot be updated.' 2 Critical   7 Triaged
1902480 #1902480 periodic-tripleo-centos-7-rocky-containers-build-push timed out during build-containers 2 Critical   7 Triaged
1903263 #1903263 periodic-tripleo-ci-centos-8-ovb-3ctlr_1comp_1supp-featureset039-security-* on different branches is failing with error "Quota exceeded, too many key pairs." 2 Critical   7 Triaged
1904223 #1904223 centos-8-scenario002-standalone failing tempest - SSH timed out 2 Critical   7 Triaged
1906518 #1906518 scenario 10 in tripleo-ansible doesn't run octavia featureset 2 Critical   7 Triaged
1907112 #1907112 Nova keypair for triple0 octavia deployment 2 Critical Rohit Londhe  7 Triaged
1908005 #1908005 multinode-oooq-container-update c7 timing out too often 2 Critical   7 Triaged
1908054 #1908054 Collect logs failing to collect logs 2 Critical   7 Triaged
1908328 #1908328 tripleo-tox-molecule centos/7/storage/x86_64/ceph-octopus/repodata/repomd.xml: [Errno 14] HTTP Error 404 2 Critical Sorin Sbarnea  7 Triaged
1909008 #1909008 tempest.lib.exceptions.PreconditionFailed: Precondition Failed on standalone-full-tempest-api-master 2 Critical   7 Triaged
1912512 #1912512 RHOSP enforcement is not needed for all role composition. 2 Critical Sofer Athlan-Guyot  7 Triaged
1914600 #1914600 periodic-tripleo-ci-centos-8-scenario010-ovn-provider-standalone-master/victoria/ussuri is failing on tempest test - octavia_tempest_plugin.tests.scenario.v2.test_traffic_ops.TrafficOperationsScenarioTest 2 Critical   7 Triaged
1915242 #1915242 [Train] [CentOS7] Undercloud jobs puppet task ertmonger_certificate[haproxy-external-cert] fails with Unrecognized parameter or wrong value type 2 Critical   7 Triaged
1916695 #1916695 periodic-tripleo-ci-centos-7-multinode-1ctlr-featureset010-rocky is failing with NeutronError: "Invalid input for operation: segmentation_id requires physical_network for VLAN provider network" 2 Critical   7 Triaged
1916742 #1916742 Victoria Container build job is failing, buildah deprecations warning is added as a first item in the list instead of container name 2 Critical   7 Triaged
1918333 #1918333 victoria, scenario001: tempest.scenario.test_snapshot_pattern.TestSnapshotPattern.test_snapshot_pattern fails to reach active state 2 Critical   7 Triaged
1918476 #1918476 ussuri fs035, tempest.api.object_storage.test_container_services.ContainerTest.test_list_container_contents_with_path fails w/ mismatch error 2 Critical   7 Triaged
1918597 #1918597 RuntimeError: Connection to the server '03907c5e-9ddc-402c-813b-4a4ee0eea8df' through port 3344 is not possible. failing on periodic standalone-full-tempest-scenario-master 2 Critical   7 Triaged
1921400 #1921400 TestNetworkBasicOps.test_connectivity_between_vms_on_different_networks in master fails on auth 2 Critical   7 Triaged
1921501 #1921501 Wallaby: ovb job are failing at overcloud deploy during baremetal provisioning, ERROR neutron.agent.dhcp.agent TypeError: Object of type 'ValueError' is not JSON serializable 2 Critical   7 Triaged
1921716 #1921716 Puppet-tripleo unit test Failure/Error: is_expected.to contain_class('tripleo::profile::base::memcached') 2 Critical   7 Triaged
1921924 #1921924 [update] tripleo-upgrade validation option is broken for infrared. 2 Critical Sofer Athlan-Guyot  7 Triaged
1921938 #1921938 ci: promoter server does not log a promotion 2 Critical   7 Triaged
1923194 #1923194 master promotion: tempest.scenario.test_minimum_basic.TestMinimumBasicScenario.test_minimum_basic_scenario is failing on fs020 and tempest-scenario 2 Critical   7 Triaged
1923221 #1923221 tripleo-ci promoter fails in "check if images were pushed" 2 Critical   7 Triaged
1927952 #1927952 tripleo-ci-centos-8-content-provider failed to pull containers from quay.ceph.io 2 Critical   7 Triaged
1928533 #1928533 Podman integration job fails bc unknown capability "CAP_PERFMON" 2 Critical chandan kumar  7 Triaged
1930871 #1930871 Sc07 jobs are failing because tempest is not running any test, tempest must always have at least one job running. 2 Critical   7 Triaged
1931516 #1931516 scenario.test_volume_encryption.VolumeEncryptionTest.test_encrypted_cinder_volumes_luks fails in master unexpected repsonse code 2 Critical   7 Triaged
1933115 #1933115 neutron_tempest_plugin.api.test_subnets.SubnetServiceTypeTestJSON.test_allocate_ips_are_from_correct_subnet fails with Unrecognized attribute(s) 'service_types' 2 Critical   7 Triaged
1933220 #1933220 [Wallaby] Overcloud Node Network Config fails - Gathering Facts - port 22: Connection refused 2 Critical Harald Jensås  7 Triaged
1936420 #1936420 tempest.scenario.test_network_basic_ops.TestNetworkBasicOps.test_port_security_macspoofing_port fails times out upstream infra, not in rdo infra 2 Critical Kamil Sambor  7 Triaged
1936459 #1936459 tripleo_update_trusted_cas molecule job fails 2 Critical Ade Lee  7 Triaged
1938041 #1938041 Upgrades job fails with Ansible 2.11 when trying to use docker module 2 Critical   7 Triaged
1940007 #1940007 scenario10 and scenario010-ovn master jobs are failing standalone deploy - Failed to find some config files: /etc/octavia/post-deploy.conf 2 Critical   7 Triaged
1940555 #1940555 Compute Component: Error: (pymysql.err.ProgrammingError) (1146, "Table 'nova_api.cell_mappings' doesn't exist") 2 Critical   7 Triaged
1940568 #1940568 neutron_tempest_plugin.scenario.test_floatingip.FloatingIpMultipleRoutersTest.test_reuse_ip_address_with_other_fip_on_other_route failing with 'IP address already allocated' 2 Critical   7 Triaged
1943708 #1943708 neutron_tempest_plugin.scenario.test_trunk.TrunkTest.test_trunk_subport_lifecycle fails with Port already has an attached device 2 Critical   7 Triaged
1943856 #1943856 requested access to the resource is denied in Pull failed containers from dockerhub 2 Critical   7 Triaged
1886028 #1886028 Registering node and repos can happen after some module check for packages. 3 High Sofer Athlan-Guyot  7 Triaged
1886971 #1886971 Refactor _standalone_deploy 3 High   7 Triaged
1888388 #1888388 custom network names not taken into account for extraconfig/nova_metadata/krb-service-principals/role.role.j2.yaml 3 High   7 Triaged
1889681 #1889681 jinja template renders incorrectly . ChunkedEncodingError: ('Connection broken: IncompleteRead(0 bytes read)', IncompleteRead(0 bytes read)) 3 High   7 Triaged
1897430 #1897430 Deployment Failed With Permission Denied when /tmp is mounted with noexec flag 3 High   7 Triaged
1897626 #1897626 sahara containers are not built for centos-8 train and ussuri 3 High   7 Triaged
1905683 #1905683 Problem: package python3-openvswitch-2.12.0-1.1.el8.x86_64 requires libopenvswitch-2.12.so.0()(64bit), but none of the providers can be installed 3 High   7 Triaged
1905687 #1905687 problem with installed package crypto-policies-scripts-20200713-1.git51d1222.el8.noarch with tripleo-ansible molecule jobs due to rhel-8.3 ubi image 3 High   7 Triaged
1906625 #1906625 Observing concurrent ansible puppet invocations 3 High   7 Triaged
1906769 #1906769 periodic-tripleo-ci-centos-8-standalone-full-tempest-scenario-master failing intermitently with paramiko.ssh_exception.AuthenticationException: Authentication failed 3 High   7 Triaged
1907094 #1907094 Octavia CI job is non-voting because unstable/timing out more frequently 3 High Brent Eagles  7 Triaged
1907827 #1907827 octavia-housekeeping container failed to exit 0 3 High   7 Triaged
1908425 #1908425 "fetch the archive" play from tripleo-transfer is not reliable for huge files 3 High Jose Luis Franco  7 Triaged
1908982 #1908982 tempest.lib.exceptions.SSHTimeout: Connection to the 192.168.24.115 via SSH timed out. failing on standalone-full-tempest-scenario-master/victoria/ussuri 3 High   7 Triaged
1909574 #1909574 periodic-tripleo-ci-centos-8-scenario010-kvm-standalone-octavia-master/victoria/ussuri failing on tempest tests with SSHTimeout issue with error message "socket.timeout: timed out" 3 High   7 Triaged
1909658 #1909658 periodic-tripleo-ci-centos-8-singlenode-featureset050-upgrades-ussuri is failing during undercloud install with message - error checking if pulling from registry is blocked: unable to parse the registries configuration (/etc/containers/registries.conf): mixing sysregistry v1/v2 is not supported 3 High   7 Triaged
1911885 #1911885 Incomplete /etc/hosts generation for multi-stack 3 High   7 Triaged
1913623 #1913623 neutron cleanup service can interfere with agents on reboot 3 High Brent Eagles  7 Triaged
1914229 #1914229 DNS servers retrieval change with systemd-resolved 3 High   7 Triaged
1914265 #1914265 CI: Content provider jobs should have dstat statistics 3 High Amol Kahat  7 Triaged
1917878 #1917878 emit_releases based jobs are not considering dlrn_hash vars published by provider jobs 3 High   7 Triaged
1918366 #1918366 FATAL | Check Keystone project status | undercloud | item=service failing on fs001, fs035 and fs039 3 High   7 Triaged
1919323 #1919323 tripleo-upgrade ping test may report false negative. 3 High Sofer Athlan-Guyot  7 Triaged
1919449 #1919449 --template <path-to-tht> is broken for standaone 3 High   7 Triaged
1921401 #1921401 Failed to pull cinder-volume and heat-api containers from victoria content provider job 3 High   7 Triaged
1921409 #1921409 openstack-tox-tht is failing with Ansible failed to install tripleo-ansible in directory 3 High   7 Triaged
1921493 #1921493 Tempest tests failing with Exceeded maximum number of retries. Exhausted all hosts available for retrying build failures for instance i 3 High   7 Triaged
1922032 #1922032 Use RDO Proxy mirror instead of centos mirrors 3 High   7 Triaged
1927957 #1927957 Overcloud deployment fails "TASK | Manage container systemd services and cleanup old systemd healthchecks for /var/lib/tripleo-config/container-startup-config/step_3" 3 High   7 Triaged
1928854 #1928854 Victoria -> Wallaby Undercloud upgrade replaces undercloud-passwords.conf 3 High   7 Triaged
1930757 #1930757 tripleo-ansible module jobs are not testing the proposed change for some roles 3 High   7 Triaged
1931647 #1931647 Wallaby -> Master upgrade - Container(s) which failed to be created by podman_container module: ['neutron_dhcp'] 3 High   7 Triaged
1932584 #1932584 Wallably/Master: Overcloud deploy steps contains services that are not enabled 3 High   7 Triaged
1934008 #1934008 overcloud deploy --setup-only fails when not previously deployed 3 High   7 Triaged
1934669 #1934669 Re-running os-net-config nukes resolv.conf 3 High   7 Triaged
1934875 #1934875 nothing provides pacemaker-libs(x86-64) = 2.1.0-3.el8 needed by pacemaker-remote-2.1.0-3.el8.x86_64 3 High   7 Triaged
1934880 #1934880 containers are built with older tripleo-hash after promotions 3 High   7 Triaged
1935834 #1935834 ReadTimeoutError(\"HTTPSConnectionPool(host='raw.githubusercontent.com', port=443): Read timed out failing intermittently on most of the ovb jobs with RETRY_LIMIT 3 High   7 Triaged
1936285 #1936285 [victoria][ussuri][c8 train]testtools.matchers._impl.MismatchError: 404 != 401 failing on sc004 3 High   7 Triaged
1936406 #1936406 tripleo-ansible-inventory no longer functional in master 3 High mathieu bultel  7 Triaged
1936476 #1936476 RuntimeError: Failed to retrieve repo file from http://mirror.regionone.vexxhost-nodepool-tripleo.rdoproject.org:8080/rdo/centos8-stein/current-tripleo/delorean.repo.md5 after 20 retries fails on centos-8-undercloud-upgrade-train 3 High   7 Triaged
1943269 #1943269 tripleo-operator-molecule-tripleo_overcloud_deploy - package versions have conflicting dependencies 3 High   7 Triaged
1886915 #1886915 [TLS-E] missing hosts in freeIPA for internalapi network 4 Medium   7 Triaged
1887130 #1887130 Periodic C8 Promotion-staging jobs failing with Error: msg": "Failed to download metadata for repo 'influxdb': Cannot download repomd.xml: Cannot download repodata/repomd.xml: All mirrors were tried" 4 Medium   7 Triaged
1889212 #1889212 MaxFailPercentage: undercloud can be included for an overcloud deploy failure 4 Medium Emilien Macchi  7 Triaged
1891285 #1891285 Paunch ignores Created containers while it must start them 4 Medium   7 Triaged
1891382 #1891382 undercloud show error about tripleo-validations ansible.log not being writable 4 Medium   7 Triaged
1891925 #1891925 Untracked files in config-download-latest directory 4 Medium Yadnesh Kulkarni  7 Triaged
1892047 #1892047 Integrate tripleo-ansible-inventory into tripleoclient 4 Medium Cédric Jeanneret  7 Triaged
1892366 #1892366 TCIB: intermediate images shouldn't be referenced in tripleo_containers.yaml 4 Medium   7 Triaged
1893051 #1893051 tht reviews that dep-on a new tripleo-ansible role fail in openstack-tox-tht 4 Medium   7 Triaged
1897768 #1897768 Ansible 2.10 moved filters to collections 4 Medium   7 Triaged
1904781 #1904781 validations callback fails on stable/train 4 Medium David Peacock  7 Triaged
1910217 #1910217 Package dependencies, podman, dnf modules 4 Medium   7 Triaged
1911004 #1911004 collect-logs move container build logs from workspace 4 Medium   7 Triaged
1912184 #1912184 A container puppet task fails without logs and traces explaining any details 4 Medium   7 Triaged
1915778 #1915778 Victoria branch Scenario10 logs collection not collecting all the directory and files. 4 Medium   7 Triaged
1917575 #1917575 update_prepare fails while trying to replace deployed-server resource 4 Medium Rabi Mishra  7 Triaged
1920746 #1920746 RPM error Database environment version mismatch 4 Medium   7 Triaged
1923468 #1923468 TLS-E re-deployments slow down linearly by 1-2 minutes at every redeploy with no changes 4 Medium   7 Triaged
1926746 #1926746 ceph dashboard fails to get a certificate with tls-e 4 Medium   7 Triaged
1929204 #1929204 featureset039 - supplemental node fail to ping undercloud 4 Medium   7 Triaged
1929704 #1929704 More than one SecurityGroup exists with the name 'lb-health-mgr-sec-grp' 4 Medium   7 Triaged
1938718 #1938718 GENERIC, unable to pull ubi8:latest container 4 Medium   7 Triaged
1943055 #1943055 overcloud image processing doesn't fail if the source qcow2 is empty 4 Medium   7 Triaged
1904909 #1904909 Python virtualenv being picked up by containers 5 Low Luke Short  7 Triaged
1910564 #1910564 Add documentation about different variable args which overcloud-deploy role in tqe supports 5 Low   7 Triaged
1911442 #1911442 python2-* packages are not uninstalled from overcloud nodes 5 Low Jose Luis Franco  7 Triaged
1913787 #1913787 ControllerParameters is not composable role friendly 5 Low   7 Triaged
1926947 #1926947 tripleo-ci-centos-8-ovb-3ctlr_1comp-featureset001 failing with Error: Connection activation failed: No suitable device found for this connection (device ens3 not available because profile is not compatible with device (mismatching interface name)). 5 Low   7 Triaged
1931134 #1931134 container-check 1.0.8 broke overcloud installation 5 Low Alex Schultz  7 Triaged
1931601 #1931601 periodic-tripleo-ci-centos-8-ovb-3ctlr_1comp-featureset035-train times out frequently 5 Low Ananya Banerjee  7 Triaged
1931694 #1931694 tripleo-ci-centos-7-containers-multinode-stein fails with Error: unknown flag: --storage" 5 Low   7 Triaged
1898524 #1898524 Allow custom HW-related configs for UC minion.conf to diverge from its sibling undercloud.conf 6 Wishlist   7 Triaged
1892169 #1892169 periodic centos 8 train FS20 tempest fails test_server_connectivity_resize 1 Undecided   7 Triaged
1907655 #1907655 [Train] FFU nova_hybrid_state tasks are not idempotent 1 Undecided Jose Luis Franco  7 Triaged
1918138 #1918138 (stable/victoria and bellow) Sensitive values exposed in ansible.log 1 Undecided Cédric Jeanneret  7 Triaged
1931975 #1931975 various jobs failing on repo setup/package install - limestone mirror issues 1 Undecided   7 Triaged
1933999 #1933999 tempest.api.compute.admin.test_volumes_negative.VolumesAdminNegativeTest.test_update_attached_volume_with_nonexistent_volume_in_body and tempest.api.compute.admin.test_volumes_negative.VolumesAdminNegativeTest.tearDownClass fails in periodic-tripleo-ci-centos-8-ovb-3ctlr_1comp-featureset035-master 1 Undecided   7 Triaged
1889122 #1889122 mirror timeouts in upstream causing undercloud and standalone failures 2 Critical Ronelle Landy  8 In Progress
1889192 #1889192 Master Periodic jobs: Sc001/002 failing with Error: \", \" Problem: package rdma-core-26.0-8.el8.x86_64 requires dracut, but none of the providers can be installed 2 Critical yatin  8 In Progress
1889209 #1889209 tox-tht in tht doesn't take into accout depends-on on tripleo-ansible. 2 Critical   8 In Progress
1895822 #1895822 centos8 standalone-upgrade-ussuri fails tempest ping router IP 2 Critical Alex Schultz  8 In Progress
1902190 #1902190 Master periodic jobs are failing with "msg": "Error running container image prepare: failed" 2 Critical Sagi (Sergey) Shnaidman  8 In Progress
1913279 #1913279 overcloud-prep-containers : Update pip returns SyntaxError: invalid syntax 2 Critical Daniel Bengtsson  8 In Progress
1916875 #1916875 Remove tempest container support from Wallaby release 2 Critical chandan kumar  8 In Progress
1917366 #1917366 tripleo-ansible-centos-8-molecule-tripleo-modules - fails 'Error: no pod with name or ID testidempod found: no such pod' 2 Critical Rabi Mishra  8 In Progress
1928784 #1928784 Image build not executing in ovb check jobs for projects which affect the image building itself. 2 Critical Ronelle Landy  8 In Progress
1938638 #1938638 ci.centos jobs can't find tripleo_overcloud_image_upload role 2 Critical   8 In Progress
1940434 #1940434 scenario10 and scenario010-ovn wallaby jobs are failing standalone deploy - ceph-ansible undercloud deploy failure 2 Critical   8 In Progress
1943170 #1943170 openstack-tox-docs jobs run on tripleo-ansible changes are failing - coverage dependency conflict 2 Critical   8 In Progress
1943462 #1943462 periodic-tripleo-ci-centos-8-standalone-upgrade-tripleo-master is failing - two failures 2 Critical   8 In Progress
1943820 #1943820 Tripleo quickstart failing on convert-image task with error: 'overcloud_image' is undefined 2 Critical   8 In Progress
1890631 #1890631 container-tools module stream not enabled correctly on update 3 High Jose Luis Franco  8 In Progress
1904193 #1904193 HA: restarting control plane nodes in parallel creates unexpected pacemaker shutdown 3 High Damien Ciabrini  8 In Progress
1905460 #1905460 [tempest] no stakviz for failed tempest 3 High Rafael Folco  8 In Progress
1906486 #1906486 FS01 ovb job fails with failed to stat() /home/zuul/overcloud-full.raw 3 High   8 In Progress
1907062 #1907062 Swift tombstones are not removed in single replica mode 3 High Christian Schwede  8 In Progress
1907070 #1907070 Swift account_auditor/reaper container start relabels files every time 3 High Christian Schwede  8 In Progress
1908232 #1908232 MariaDB's table storage format change is causing errors after a FFU 3 High Damien Ciabrini  8 In Progress
1912645 #1912645 container image prepare fails if auth tokens don't have an expires_in time 3 High Alex Schultz  8 In Progress
1913675 #1913675 ci.centos gate job fails at Taks: Wait for cloud-init to finish, if enabled 3 High yatin  8 In Progress
1913733 #1913733 HA: control plane API performance can be degraded during a controller outage 3 High   8 In Progress
1915761 #1915761 large amount of memory utilization slows down ansible execution as part of the deployment 3 High Alex Schultz  8 In Progress
1916459 #1916459 tripleo-ci-centos-7-containers-multinode-queens failing on TASK [tripleo-bootstrap : Set 'dns=none' in /etc/NetworkManager/NetworkManager.conf] with "error while evaluating conditional (ansible_facts.services['NetworkManager.service']['status'] == 'enabled'): 'dict object' has no attribute 'status" 3 High Rabi Mishra  8 In Progress
1918566 #1918566 [stable-only] Deleted plan results in some password changes 3 High Rabi Mishra  8 In Progress
1921714 #1921714 tripleO-common healthcheck constantly spikes CPU by lsof 3 High Cédric Jeanneret  8 In Progress
1927953 #1927953 featureset063 - No such file or directory: '/usr/share/openstack-tripleo-heat-templates/net-config-undercloud.yaml' 3 High   8 In Progress
1928199 #1928199 featureset063 - /home/zuul/overcloud-deploy.sh: line 22: [: -gt: unary operator expected 3 High   8 In Progress
1935672 #1935672 --heat-type pod used in fs002 stein-upload job 3 High   8 In Progress
1936138 #1936138 StackAction can't be used with ephemeral heat 3 High   8 In Progress
1937166 #1937166 [centos9][ruby3] puppet-stdlib uses removed URI.escape 3 High David Vallee Delisle  8 In Progress
1886774 #1886774 fs39 fails with unable to discover domain 4 Medium Grzegorz Grasza  8 In Progress
1886932 #1886932 [update] Some update tasks have no when conditional making them run at every step waisting time. 4 Medium Sofer Athlan-Guyot  8 In Progress
1888676 #1888676 [train-only] waiting for ssh to come up during deployment spits ResourceWarnings 4 Medium Alex Schultz  8 In Progress
1889222 #1889222 OVN environment files don't disable DVR 4 Medium Jakub Libosvar  8 In Progress
1894841 #1894841 python-tripleoclient - tox-py27 stable/train broken 4 Medium Kevin Carter  8 In Progress
1907268 #1907268 tools/process-templates.py -c (clean) fails with missing directory 4 Medium James Slagle  8 In Progress
1907858 #1907858 python_cmd not set if you use a --start-at-task beyond step 1 4 Medium Alex Schultz  8 In Progress
1913782 #1913782 image-serve incorrectly builds metadata for containers with no namespace 4 Medium Alex Schultz  8 In Progress
1915355 #1915355 Failed to create: /home/stack/config-download, error: [Errno 13] Permission denied: '/home/stack' 4 Medium Rabi Mishra  8 In Progress
1915356 #1915356 Error getting GET tempurl for overcloud-config/overcloud-config.tar.gz: public endpoint for object-store service not found 4 Medium Rabi Mishra  8 In Progress
1922002 #1922002 SELinux prevents tmpwatch to remove old logs 4 Medium Cédric Jeanneret  8 In Progress
1922179 #1922179 Accept exit status 142 for containers 4 Medium Cédric Jeanneret  8 In Progress
1928955 #1928955 fix install-dep.sh error on config-manager 4 Medium   8 In Progress
1929117 #1929117 undercloud_nameservers has no effect 4 Medium Alex Schultz  8 In Progress
1932139 #1932139 tripleo-upgrade fail to create workload related script when using tags. 4 Medium Sofer Athlan-Guyot  8 In Progress
1934002 #1934002 running deploy with --stack-only results in error creating deploy artifacts 4 Medium Rabi Mishra  8 In Progress
1942510 #1942510 Allow to pass arbitrary parameters to TCIB image config 4 Medium Cédric Jeanneret  8 In Progress
1943731 #1943731 rabbitmq 3.8 container shipds default ini-style conf file 4 Medium Michele Baldessari  8 In Progress
1943855 #1943855 "openstack overcloud status" without debug returns nothing if overcloud stack is not available 4 Medium   8 In Progress
1912797 #1912797 ansible task names don't render jinja in SKIPPED or TIMING output 5 Low Alex Schultz  8 In Progress
1893025 #1893025 Add support for timemaster service 6 Wishlist Haresh  8 In Progress
1905585 #1905585 HA: pacemaker resource lock impacts cluster transitions 1 Undecided Damien Ciabrini  8 In Progress
1918418 #1918418 In case of Neutron with ML2/OVN vlan-limit in OVS should be set 1 Undecided Slawek Kaplonski  8 In Progress
1916505 #1916505 export_stack can enter infinite loop 4 Medium Jiri Podivin  9 Fix Committed
1936825 #1936825 periodic undercloud upgrade ussuri fails undercloud install cannot pull containers 2 Critical   10 Fix Released
1937236 #1937236 periodic scenario1 standalone master inconsistent fail "delete orphan containers"->"Gather podman infos" 2 Critical   10 Fix Released
1938079 #1938079 tripleo-ci-centos-7-content-provider is failing in gate/check downloading ansible-2.9.24.tar.gz 2 Critical   10 Fix Released
1938266 #1938266 Molecule jobs failing for stable/ussuri with: Unable to gather info for 'molecule_local/ubi8': Error: error inspecting object: unable to find a name and tag match for molecule_local/ubi8 in repotags: no such image 2 Critical   10 Fix Released
1938283 #1938283 [Master] CI jobs failing randomly as pcs resource operations/actions times out 2 Critical yatin  10 Fix Released
1938539 #1938539 centos8 undercloud-minion job fails - puppet Error while evaluating a Function Call 2 Critical   10 Fix Released
1938558 #1938558 component glance master scenario1 standalone fails tempestconf 2 Critical   10 Fix Released
1938834 #1938834 scenario010 jobs running on train/16.2 are failing standalone deploy - Set up group_vars 2 Critical   10 Fix Released
1938932 #1938932 glance-api.conf points to sqlite driver 2 Critical Takashi Kajinami  10 Fix Released
1939023 #1939023 periodic featureset 35 wallaby times out running tempest (2 hours) 2 Critical   10 Fix Released
1939674 #1939674 tripleo-ci-centos-8-content-provider failing consistently 2 Critical   10 Fix Released
1940076 #1940076 Scenario001 standalone train is failing in tempestconf setup - Request on service 'image' with url 'http://192.168.24.1:9292' failed. Connection refused. 2 Critical   10 Fix Released
1940313 #1940313 tripleo py36 ansible error: UnicodeEncodeError: 'ascii' codec can't encode character '\xe9' in position 112: ordinal not in range(128) 2 Critical   10 Fix Released
1940329 #1940329 Error initializing source docker://198.72.124.50:5001/tripleomaster/daemon:v6.0.0-stable-6.0-pacific-centos-8-x86_64: Error reading manifest v6.0.0-stable-6.0-pacific-centos-8-x86_64 2 Critical   10 Fix Released
1940655 #1940655 periodic-tripleo-ci-centos-8-ovb-1ctlr_1comp-featureset002 failing in overcloud-delete task: 'stack_name' is undefined 2 Critical Amol Kahat  10 Fix Released
1940844 #1940844 centos-8-standalone-upgrade-ussuri failing after upgrade: Router ip address unreachable 2 Critical   10 Fix Released
1940866 #1940866 tripleo-ci-centos-8-scenario001-standalone is failing in master and wallaby (check/gate/periodic) - tempest.scenario.test_volume_boot_pattern.TestVolumeBootPattern 2 Critical Francesco Pantano  10 Fix Released
1941772 #1941772 puppet-openstack-unit-* unit tests are failing in puppet-tripleo gate/check 2 Critical   10 Fix Released
1942078 #1942078 periodic-tripleo-ci-build-containers-ubi-8-push-train is failing to build containers 2 Critical Ronelle Landy  10 Fix Released
1942356 #1942356 train OVB jobs are failing overcloud deployment "couldn't open temporary file /home/heat-admin/.ssh/sedSAD1k3: Permission denied" 2 Critical   10 Fix Released
1943034 #1943034 Redundant file ACLs for neutron when upgrading from older version of OpenStack 2 Critical   10 Fix Released
1943082 #1943082 openstack-tox-molecule timing out uploading logs in rax 2 Critical   10 Fix Released
1943330 #1943330 tripleo-ci-centos-8-standalone-on-multinode-ipa is broken due to mariadb 10.5 2 Critical   10 Fix Released
1943384 #1943384 master mariadb container images are failing - cannot stat '/usr/share/openstack-tripleo-common-containers/container-images/kolla/mariadb/security_reset.expect.10.5': No such file or directory 2 Critical Ronelle Landy  10 Fix Released
1943459 #1943459 Missing "z" flag for resources created by pacemaker 2 Critical Cédric Jeanneret  10 Fix Released
1943579 #1943579 featureset035 master failing with ERROR: Protected resource registry overrides detected 2 Critical Ronelle Landy  10 Fix Released
1900986 #1900986 Live migraion is failing in tls-everywhere scenario for existing instances with UseTLSTransportForNbd: True 3 High Martin Schuppert  10 Fix Released
1905544 #1905544 THT sets wrong default mode with NovaLibvirtCPUMode 3 High Martin Schuppert  10 Fix Released
1920704 #1920704 Cinder volume can't run at the Edge 3 High Emilien Macchi  10 Fix Released
1933336 #1933336 upload artifact tooling fails with upload-artifacts: command not found 3 High Rajesh Tailor  10 Fix Released
1933922 #1933922 [Queens] tripleo-ci-centos-7-undercloud-oooq is failing on tempest tests with "tempest run: error: unrecognized arguments: --exclude-list /home/zuul/tempest/etc/tempest_excludelist.txt --include-list /home/zuul/tempest/etc/tempest_includelist.txt" 3 High   10 Fix Released
1934879 #1934879 [victoria][ussuri][train c8]tempest.lib.exceptions.TimeoutException: Request timed out failing in scenario004-standalone 3 High   10 Fix Released
1936205 #1936205 Destination /etc/yum.repos.d/CentOS-Stream-AppStream.repo does not exist ! fails on c7 train container push job 3 High Sandeep Yadav  10 Fix Released
1936776 #1936776 "503 Service Unavailable: No server is available to handle this request." fails on standalone-on-multinode-ipa and fs039 3 High Rabi Mishra  10 Fix Released
1937035 #1937035 Create router failed with The server didn't respond in time.: 504 Gateway Time-out 3 High   10 Fix Released
1938833 #1938833 tripleo cephadm deploy has require_min_compat_client luminous 3 High John Fulton  10 Fix Released
1939445 #1939445 Octavia certs don't update across all nodes 3 High Brent Eagles  10 Fix Released
1940838 #1940838 Issue while importing nodes and making them available 3 High Harald Jensås  10 Fix Released
1942198 #1942198 ceph ssl radosgw port is closed for tempest 3 High   10 Fix Released
1942704 #1942704 ModuleNotFoundError: No module named 'coverage' 3 High   10 Fix Released
1943254 #1943254 ovn-dbs update tasks can take place when the cluster is down 3 High Michele Baldessari  10 Fix Released
1931145 #1931145 upgrade with TLS-e fails due to container creation conflict with redis_tls_proxy 4 Medium Michele Baldessari  10 Fix Released
1931729 #1931729 [train] After successful minor update galera will fail to restart 4 Medium   10 Fix Released
1934009 #1934009 overcloud deploy --stack-only no longer downloads ansible playbooks 4 Medium   10 Fix Released
1934116 #1934116 warnings at every openstack command invocation 4 Medium   10 Fix Released
1938639 #1938639 Ganesha bound to wrong network address in Standalone deployments 4 Medium Tom Barron  10 Fix Released
1939088 #1939088 is_<type> method is deprecated 4 Medium Takashi Kajinami  10 Fix Released
1940571 #1940571 container-puppet containers fail to restart after upload-artifacts 4 Medium Damien Ciabrini  10 Fix Released
1940685 #1940685 The 'tripleoclient.export.export_stack' contains a race condition 4 Medium Jiri Podivin  10 Fix Released
1941698 #1941698 rabbitmq's crash.log gets rotated twice 4 Medium Michele Baldessari  10 Fix Released
1942675 #1942675 haproxy manifest is not compatible with haproxy 2.4 4 Medium Michele Baldessari  10 Fix Released
1911022 #1911022 ganesha_vip is not set in standalone deployments 5 Low Tom Barron  10 Fix Released
1887830 #1887830 puppet-tripleo jobs fail in ussuri in puppet linter checks 1 Undecided Damien Ciabrini  10 Fix Released
This milestone contains Public information
Everyone can see this information.