Launchpad.net

lgw01-amd64-006

lgw01-amd64-006 builds amd64 and i386 binaries and is owned by William Grant.

View full history Current status

20377269 [building] Building amd64 build of ga 5.4~beta~r10636+dfsg-5.1build1 in ubuntu cosmic PROPOSED

Started 3 days, 6 hours, 4 minutes, 42.3 seconds ago.

Buildlog

set_auto_verify
           3 MA_set_error_print
           0 MA_set_hard_fail
           0 MA_set_numalign
           9 MA_sizeof
           3 MA_sizeof_overhead
           6 MA_summarize_allocated_blocks
           0 MA_trace
           4 MA_verify_allocator_stuff
 stop testing MA_print_stats

 should fail (not implemented) ...
MA error: MA_init_memhandle_iterator: not yet implemented
 ... failure

 should fail (not implemented) ...
MA error: MA_get_next_memhandle: not yet implemented
 ... failure

 start testing MA_set_hard_fail ...
 should see a (nonfatal) MA error message here ...
MA error: MA_pop_stack: handle -1 is not valid
 should see a (hard failure) MA error message here ...
MA hard failure: MA_pop_stack: handle -1 is not valid
make[6]: *** [Makefile:8310: ma/testf.log] Error 1
FAIL: global/testing/elempatch.x
--------------------------------------------------------------------------
[[50075,1],0]: A high-performance Open MPI point-to-point messaging module
was unable to find any relevant network interfaces:

Module: OpenFabrics (openib)
  Host: lgw01-amd64-006

Another transport will be used instead, although this may result in
lower performance.

NOTE: You can disable this warning by setting the MCA parameter
btl_base_warn_component_unused to 0.
--------------------------------------------------------------------------
make[6]: *** Deleting file 'global/testing/elempatch.log'
E: Caught signal ‘Terminated’: terminating immediately
make[5]: *** wait: No child processes. Stop.
make[5]: *** Waiting for unfinished jobs....
make[5]: *** wait: No child processes. Stop.
make[4]: *** wait: No child processes. Stop.
make[4]: *** Waiting for unfinished jobs....
make[4]: *** wait: No child processes. Stop.
make[1]: [debian/rules:30: override_dh_auto_test] Terminated (ignored)
make[6]: *** [Makefile:8317: global/testing/elempatch.log] Terminated
make[3]: *** [Makefile:8055: check-recursive] Terminated
make[2]: *** [Makefile:8988: check] Terminated
make: *** [debian/rules:8: build] Terminated

Builder information

Architectures:
amd64 i386 (virtual)
Location:
http://lgw01-amd64-006.vbuilder.lgw01.scalingstack:8221/
Owner:
William Grant
Mode:
This builder is in auto-mode and accepting jobs from the auto-build system.
Version:
163